Scientific Linux

  Reply to this topicStart new topicStart Poll

> collect2: fatal error: cannot find 'ld'
 Posted: Sep 25 2016, 05:24 PM
Quote Post

SLF Newbie

Group: Members
Posts: 3
Member No.: 3761
Joined: 22-September 16

I'm trying to run the charybdis2 simulation, and after installing GCC 6.2.0, when I attempt to make I get the error "collect2: fatal error: cannot find 'ld' ".I'm completely lost and don't know what to do; which ld results in /usr/bin/ld . Any help would be very much appreciated.
The full output on the terminal is

gfortran -I. -o charybdis2-1.0.4.exe charybdis2-1.0.4.o pythia-6.4.28.o mainpythia.o
collect2: fatal error: cannot find 'ld'
compilation terminated.
make: *** [charybdis2-1.0.4.exe] Error 1
1 User(s) are reading this topic (1 Guests and 0 Anonymous Users)
0 Members:

Topic Options Reply to this topicStart new topicStart Poll